{"text_format":"1","workbook":"xlsx","n_sheets":9,"sheets":["INPUT","Results Summary","DCFROR","Mass Balance","OPEX","CAPEX","Cost Breakdown","Facility_Dim","Quick Access Charts"],"not_rendered":{"charts":1,"images":2,"macros":1,"external_links":1,"defined_names":50,"comments":0,"pivot_tables":0},"unopened":[],"bounds":{"document_bytes":16777216,"sheet_cells":100000,"rows_first":2000,"rows_last":500,"rows_between":2000,"halvings":0,"cell_chars":16384,"cell_head_chars":4096},"cells_cut":0,"cells_raw":0,"read":"whole","date_system":"1900"}

{"sheet":"INPUT","index":0,"n_rows":77,"n_cols":9,"rows_kept":77,"cut":false,"hidden":false,"merged":[]}
["Use of this tool is subject to a disclaimer (https://www.nrel.gov/disclaimer.html)"]
["Overall process/design framework for this TEA tool is based on NREL's Algae Farm Design Report - for details refer to: https://www.nrel.gov/docs/fy16osti/64772.pdf "]
["Biomass cost results differ from Design Report due to different cost-year dollars (more recent work updates parameters further to 2016$ and 21% tax rates)"]
[null," "]
[null," ",null," "]
["INPUT DATA"]
[]
[null,null,null,null," "]
["Main Process Inputs",null,null,null,null,null,"= Input Required"]
["Facility size (based on cultivation area)",5000,"acres",null,null,null,"= Calculated Cells"]
["Module size (based on cultivation area)",100,"acres","Recommend leaving default at 100 acres, may be varied from 1-500",null,null,"= No Input Required"]
["Individual pond size","10-acre",null,null,null,null,"=Aditional Notes"]
["Pond liner coverage","Minimally Lined"]
["Pond depth",20,"cm"]
["Pond harvest concentration",0.5,"g/L","Values allowed from 0.0001 to 0.9999 g/L. Above 1 will cause unsolveable dewatering steps. "]
{"$rows_left_out":63}
{"sheet":"Results Summary","index":1,"n_rows":46,"n_cols":10,"rows_kept":46,"cut":false,"hidden":false,"merged":[[43,3,43,4],[44,3,44,4],[0,0,0,5],[1,0,1,5],[2,0,2,5],[3,0,3,5],[42,3,42,4]]}
["Algal Biomass Production Process Engineering Analysis"]
[]
[]
[{"$f":"\"All Values in \"&INPUT!B70&\"$\"","v":"All Values in 2014$"},null,null,null,null,null,null,null,null," "]
[null,null,"MBSP (Minimum Biomass Selling Price):",{"$f":"DCFROR!B31","v":494.0318824103901},"/US Dry Ton (AFDW)"]
[null,"Contributions:","CO2 and Nutrients",{"$f":"ROUND(SUM(F18:F20),0)","v":120},{"$f":"\"/US Dry Ton\"","v":"/US Dry Ton"}]
[null,null,"Cultivation ",{"$f":"'Cost Breakdown'!G4+'Cost Breakdown'!G5","v":273.99201130768995},{"$f":"\"/US Dry Ton\"","v":"/US Dry Ton"}]
[null,null,"Other Production ",{"$f":"'Cost Breakdown'!G6+'Cost Breakdown'!G7+'Cost Breakdown'!G8+'Cost Breakdown'!G9","v":99.910854445461723},{"$f":"\"/US Dry Ton\"","v":"/US Dry Ton"}]
[null,null,"Total Biomass Production (AFDW Basis)",{"$f":"OPEX!B3","v":0.18747791960589236},{"$f":"\"MM US Ton/yr\"","v":"MM US Ton/yr"}]
[null,null,"Total Biomass Yield (AFDW Basis)",{"$f":"D9*1000000/INPUT!B10","v":37.495583921178472},{"$f":"\"US Ton/acre/yr\"","v":"US Ton/acre/yr"}]
[null,null,null,{"$f":"D9*1000000*0.9072/(INPUT!B10*0.4047)","v":84.052368997512005},{"$f":"\"Metric tonne/ha/yr\"","v":"Metric tonne/ha/yr"}]
[]
[null,null,"Internal Rate of Return (After-Tax)",{"$f":"INPUT!B72","v":0.1}]
[null,null,"Equity Percent of Total Investment",{"$f":"INPUT!B74","v":0.4}]
[]
{"$rows_left_out":32}
{"sheet":"DCFROR","index":2,"n_rows":123,"n_cols":60,"rows_kept":123,"cut":false,"hidden":false,"merged":[[7,6,7,8],[8,6,8,8],[0,11,0,13],[2,6,2,8],[3,6,3,8],[4,6,4,8],[5,6,5,8],[6,6,6,8]]}
[null,null,null,1,null,null,"Total Capital Investment",null,null,null,null,"Installed cost"]
[null,null,null,null,null,null,"Process Area",null,null,"Purchased Cost",null,"Cultivation","Dewatering","OSBL","Installed Cost"]
["Assumptions","Value",null,"Land Requirement",null,null,{"$f":"\"Area 100:  Production\"","v":"Area 100:  Production"},null,null,{"$f":"CAPEX!L11","v":155908879.7182858},null,{"$f":"CAPEX!M11","v":155908879.7182858},null,null,{"$f":"SUM(L3:N3)","v":155908879.7182858}]
["Fixed Capital Investment",{"$f":"O24*D1","v":344018850.04773784},null,{"$f":"INPUT!B10/5000*7615","v":7615},"Acres"," ","Area 200: Inoculum Ponds",null,null,{"$f":"CAPEX!L19","v":15567153.964508031},null,{"$f":"CAPEX!M19","v":15567153.964508031},null,null,15567153.964508031]
["   General Plant",{"$f":"B4-B6","v":344018850.04773784},null,3000,"/acre",null,"Area 300: CO2 Delivery",null,null,{"$f":"CAPEX!L28","v":6174286.882421134},null,null,null,{"$f":"CAPEX!M28","v":6571607.175287093},6571607.175287093]
["   Steam/Power Plant",0,null,null,null,null,"Area 400: Makeup Water Delivery + On-Site Circulation",null,null,{"$f":"CAPEX!L47","v":5343186.1727561001},null,null,null,{"$f":"CAPEX!M47","v":7098111.7640091926},7098111.7640091926]
[null,null,null,null,null,null,"Area 500: Dewatering",null,null,{"$f":"CAPEX!L57","v":40910049.283013806},null,null,{"$f":"CAPEX!M57","v":42964817.957421519},null,42964817.957421519]
["Equity",{"$f":"INPUT!B74","v":0.4},null,null," ",null,"Area 600: Storage",null,null,{"$f":"CAPEX!L64","v":4089312.9665676164},null,null,null,{"$f":"CAPEX!M64","v":5444624.4039622219},5444624.4039622219]
["   Loan Interest",{"$f":"INPUT!B75","v":0.08}]
["   Loan Term, years",{"$f":"INPUT!B76","v":10}]
["   Annual Loan Payment",{"$f":"-PMT(B9,B10,FCI*(1-B8))","v":30761371.994862132}]
["Working Capital (% of FCI)",0.05,null,null,null,null,"Totals (Excl. Area 100)",null,null,{"$f":"SUM(J3:J11)","v":227992868.98755249},null,{"$f":"SUM(L3:L11)","v":171476033.68279383},{"$f":"SUM(M3:M11)","v":42964817.957421519},{"$f":"SUM(N3:N11)","v":19114343.343258508},{"$f":"SUM(L12:N12)","v":233555194.98347384}]
["Salvage Value",null,null,null,null,null,null,null,"Standard factors","Cultivation Factors","OSBL Factors",null,null,null,{"$f":"SUM(L13:N13)","v":0}]
["   General Plant",0,"Not permitted since 2002",null,null,null,"   Warehouse",null,0.04,1.2200000000000001E-2,0,{"$f":"J14*L12","v":2092007.6109300847},{"$f":"I14*M12","v":1718592.7182968608},{"$f":"K14*$N$12","v":0},3810600.3292269455]
["   Steam Plant",0,"Not permitted since 2002",null,null,null,"   Site Development",null,0.09,"Included in pond cost"," $1534/acre",null,{"$f":"I15*M12","v":3866833.6161679365},{"$f":"1534*D4","v":11681410},15548243.616167936]
{"$rows_left_out":109}
{"sheet":"Mass Balance","index":3,"n_rows":156,"n_cols":44,"rows_kept":156,"cut":false,"hidden":false,"merged":[]}
[]
[null,null,"FLOW DIAGRAM"]
[null,null,"(note, this is only an overall schematic of the process, beyond individual processing equipment, pumps, piping, etc)",null,null,null,null,null,null,null,null,null,null,null,null," "]
[]
[null,null,null,null,null,{"$f":"C61*2.205/2000*24","v":11.002491791972481},"ton/day NH3",null,null,null,null,null,null,null,null,null,null,null,null,null,null,null,null,null,null,null,null,null,null,null,null,null,null,null,null,null,null,null,null,null,null,null,"a"]
[null,null,null,null,null,{"$f":"C62*2.205/2000*24","v":5.3482210411043205},"ton/day DAP"]
[]
[null,null,null,null,null,null,null,null,null,{"$f":"H67*2.205/2000*24","v":19464.005491875003},"ton/day Water",null,null,null,null,null,null,null,null,null,null,null,null,null,null,null,null,null,null,null,{"$f":"U56/2000*2.205*24","v":2879.3364216935061},null,null,"ton/day"]
[null,null,null,null,null,null,null,null,null,{"$f":"H56*2.205/2000*24-J8","v":1076.5861192815428},"ton/day Other",null,null,null,null,{"$f":"R56/2000*2.205*24","v":6931.40854414368},"ton/day"]
[]
[null,null,null,null,null,{"$f":"D56*2.205/2000*24","v":29047.786966921725},"ton/day"]
[]
[]
[null,null,null,null,null,null,null,null,null,null,null,{"$f":"F56/2000*2.205*24","v":1255836.6091915597},"ton/day"]
[]
{"$rows_left_out":142}
{"sheet":"OPEX","index":4,"n_rows":87,"n_cols":19,"rows_kept":87,"cut":false,"hidden":false,"merged":[[78,0,78,12],[10,0,10,12],[54,0,54,12],[63,0,63,12]]}
[null,"AVERAGE","SUMMER","FALL","WINTER","SPRING"]
["Dry Algae Biomass Production Rate (kg/hr)",{"$f":"AVERAGE(C2:F2)","v":21470.707025572316},{"$f":"'Mass Balance'!U90","v":30032.182752221805},{"$f":"'Mass Balance'!U111","v":21370.908768322683},{"$f":"'Mass Balance'!U132","v":10038.795463425427},{"$f":"'Mass Balance'!U153","v":24440.941118319341},null," "]
["BIOMASS Production Rate (MM US Dry Ton/yr)",{"$f":"B2*2.205/2000*B7/1000000","v":0.18747791960589236},{"$f":"C2*2.205/2000*$B$7/1000000","v":0.26223501335585037},{"$f":"D2*2.205/2000*$B$7/1000000","v":0.18660650118324001},8.7656754227538158E-2,0.21341340965694081]
[" "," "]
["Operating Cost Analysis"]
[]
["Operating Hours/Yr",{"$f":"INPUT!B71","v":7920}]
[]
["Variable Operating Costs"]
[null,"Costing Code","Raw Material","Stream No.","kg/hr","lb/hr","Quoted Price (cents / ton)","Year of Price Quote",{"$f":"INPUT!B70 &\" (Cost $ / ton)\"","v":"2014 (Cost $ / ton)"},{"$f":"costyear & \" Cost ($/lb)\"","v":"2014 Cost ($/lb)"},"$/hour",{"$f":"\"MM$/yr (\" & INPUT!B70 & \")\"","v":"MM$/yr (2014)"},{"$f":"\"$/Dry US Ton Algae (\"&INPUT!B70&\")\"","v":"$/Dry US Ton Algae (2014)"}]
["Raw Materials"]
["A100",null,"CO2 cost","Summer ",{"$f":"'Mass Balance'!O86","v":66877.349412326526},{"$f":"E12*2.205","v":147464.55545417999},{"$f":"INPUT!$B$77*907/1000*100","v":4081.5},2011,{"$f":"G12*VLOOKUP(INPUT!$B$70,'Quick Access Charts'!$O$37:$P$75,2,FALSE)/VLOOKUP(H12,'Quick Access Charts'!$O$37:$P$75,2,FALSE)/100","v":43.583490678302262},{"$f":"I12/2000","v":2.1791745339151132E-2},{"$f":"F12*J12","v":3213.5100390086204},{"$f":"K12*$B$7/1000000","v":25.450999508948275},{"$f":"L12/$C$3","v":97.05416215496561}]
[null,null,null,"Fall",{"$f":"'Mass Balance'!O107","v":47578.457153340874},{"$f":"E13*2.205","v":104910.49802311663},{"$f":"INPUT!$B$77*907/1000*100","v":4081.5},2011,{"$f":"G13*VLOOKUP(INPUT!$B$70,'Quick Access Charts'!$O$37:$P$75,2,FALSE)/VLOOKUP(H13,'Quick Access Charts'!$O$37:$P$75,2,FALSE)/100","v":43.583490678302262},{"$f":"I13/2000","v":2.1791745339151132E-2},{"$f":"F13*J13","v":2286.1828563232757},{"$f":"K13*$B$7/1000000","v":18.106568222080341},{"$f":"L13/$D$3","v":97.030747092248546}]
[null,null,null,"Winter",{"$f":"'Mass Balance'!O128","v":22356.142517834862},49295.294251825871,{"$f":"INPUT!$B$77*907/1000*100","v":4081.5},2011,{"$f":"G14*VLOOKUP(INPUT!$B$70,'Quick Access Charts'!$O$37:$P$75,2,FALSE)/VLOOKUP(H14,'Quick Access Charts'!$O$37:$P$75,2,FALSE)/100","v":43.583490678302262},2.1791745339151132E-2,1074.23049875431,8.5079055501341347,{"$f":"L14/$E$3","v":97.059326746795051}]
[null,null,null,"Spring ",{"$f":"'Mass Balance'!O149","v":54457.27023575161},120078.28086983231,{"$f":"INPUT!$B$77*907/1000*100","v":4081.5},2011,{"$f":"G15*VLOOKUP(INPUT!$B$70,'Quick Access Charts'!$O$37:$P$75,2,FALSE)/VLOOKUP(H15,'Quick Access Charts'!$O$37:$P$75,2,FALSE)/100","v":43.583490678302262},2.1791745339151132E-2,2616.7153174784489,20.724385314429316,{"$f":"L15/$F$3","v":97.109105504398656}]
{"$rows_left_out":73}
{"sheet":"CAPEX","index":5,"n_rows":83,"n_cols":13,"rows_kept":83,"cut":false,"hidden":false,"merged":[[0,2,1,2],[0,3,1,12]]}
[null,null,null,"Scaled Installed Costs"]
[]
[null,"EQUIPMENT TITLE","$","Year of Quote","Scaling Val","Units","Scaling Exp","Inst Factor","New Val","Size Ratio","Scaled Purch Cost","Purch Cost in Proj year","Inst Cost in Proj year"]
[null,"A100: Production Ponds","Further details behind pond design/cost elements and individual sources for pond inputs can be found in NREL algae farm design report"]
[null,"AVERAGE of 10-acre Costs",158506910,2011,5000,"acre",1,1,{"$f":"IF(INPUT!$B$12=\"10-acre\",IF(INPUT!$B$13=\"Minimally Lined\",INPUT!$B$10,0),0)","v":5000},{"$f":"I5/E5","v":1},{"$f":"C5*J5^G5","v":158506910},{"$f":"K5*VLOOKUP(INPUT!$B$70,'Quick Access Charts'!$O$6:$P$34,2,FALSE)/VLOOKUP(D5,'Quick Access Charts'!$O$6:$P$34,2,FALSE)","v":155908879.7182858},{"$f":"L5*H5","v":155908879.7182858}]
[null,"AVERAGE of 10-acre Costs Full Liner Option",276539009,2011,5000,"acre",1,1,{"$f":"IF(INPUT!$B$12=\"10-acre\",IF(INPUT!$B$13=\"Minimally Lined\",0,INPUT!$B$10),0)","v":0},0,0,{"$f":"K6*VLOOKUP(INPUT!$B$70,'Quick Access Charts'!$O$6:$P$34,2,FALSE)/VLOOKUP(D6,'Quick Access Charts'!$O$6:$P$34,2,FALSE)","v":0},0]
[null,"AVERAGE of 2-acre Costs",246531755,2011,5000,"acre",1,1,{"$f":"IF(INPUT!$B$12=\"2-acre\",IF(INPUT!$B$13=\"Minimally Lined\",INPUT!$B$10,0),0)","v":0},0,0,{"$f":"K7*VLOOKUP(INPUT!$B$70,'Quick Access Charts'!$O$6:$P$34,2,FALSE)/VLOOKUP(D7,'Quick Access Charts'!$O$6:$P$34,2,FALSE)","v":0},0]
[null,"AVERAGE of 2-acre Costs Full Liner Option",365691872,2011,5000,"acre",1,1,{"$f":"IF(INPUT!$B$12=\"2-acre\",IF(INPUT!$B$13=\"Minimally Lined\",0,INPUT!$B$10),0)","v":0},0,0,{"$f":"K8*VLOOKUP(INPUT!$B$70,'Quick Access Charts'!$O$6:$P$34,2,FALSE)/VLOOKUP(D8,'Quick Access Charts'!$O$6:$P$34,2,FALSE)","v":0},0]
[null,"AVERAGE of 50-acre Costs",98673256,2011,5000,"acre",1,1,{"$f":"IF(INPUT!$B$12=\"50-acre\",IF(INPUT!$B$13=\"Minimally Lined\",INPUT!$B$10,0),0)","v":0},0,0,{"$f":"K9*VLOOKUP(INPUT!$B$70,'Quick Access Charts'!$O$6:$P$34,2,FALSE)/VLOOKUP(D9,'Quick Access Charts'!$O$6:$P$34,2,FALSE)","v":0},0]
[null,"AVERAGE of 50-acre Costs Full Liner Option",250468668,2011,5000,"acre",1,1,{"$f":"IF(INPUT!$B$12=\"50-acre\",IF(INPUT!$B$13=\"Minimally Lined\",0,INPUT!$B$10),0)","v":0},0,0,{"$f":"K10*VLOOKUP(INPUT!$B$70,'Quick Access Charts'!$O$6:$P$34,2,FALSE)/VLOOKUP(D10,'Quick Access Charts'!$O$6:$P$34,2,FALSE)","v":0},0]
[null,"Total",null,null,null,null,null,null,null,null,{"$f":"SUM(K5:K10)","v":158506910},{"$f":"SUM(L5:L10)","v":155908879.7182858},155908879.7182858]
[null,"A200: Inocululation System ","See NREL design report for further information"]
[null,"Tubular Photobioreactors ",18.22,2014,1,"m^2",1,1,{"$f":"'Quick Access Charts'!B39*10000*1.5","v":32374.880000000001},{"$f":"I13/E13","v":32374.880000000001},{"$f":"C13*J13^G13","v":589870.31359999999},{"$f":"K13*VLOOKUP(INPUT!$B$70,'Quick Access Charts'!$O$6:$P$34,2,FALSE)/VLOOKUP(D13,'Quick Access Charts'!$O$6:$P$34,2,FALSE)","v":589870.31359999999},{"$f":"L13*H13","v":589870.31359999999}]
[null,"Inoculum Covered Pond Costs (minus liners)",5427316,2014,100,"wetted acres",1,1,{"$f":"'Quick Access Charts'!B38*2.47105","v":22.857127778285719},0.22857127778285719,1240528.5530513453,{"$f":"K14*VLOOKUP(INPUT!$B$70,'Quick Access Charts'!$O$6:$P$34,2,FALSE)/VLOOKUP(D14,'Quick Access Charts'!$O$6:$P$34,2,FALSE)","v":1240528.5530513453},1240528.5530513453]
[null,"Inoculum Lined Pond Costs (minus liners)",5427316,2014,100,"wetted acres",1,1,{"$f":"'Quick Access Charts'!B37*2.47105","v":114.28563889142858},1.1428563889142858,6202642.7652567262,{"$f":"K15*VLOOKUP(INPUT!$B$70,'Quick Access Charts'!$O$6:$P$34,2,FALSE)/VLOOKUP(D15,'Quick Access Charts'!$O$6:$P$34,2,FALSE)","v":6202642.7652567262},6202642.7652567262]
{"$rows_left_out":69}
{"sheet":"Cost Breakdown","index":6,"n_rows":10,"n_cols":9,"rows_kept":10,"cut":false,"hidden":false,"merged":[[1,10,1,14]]}
["Portion of MBSP for each cost in each area"]
["AREA",null,"Capital Recovery Charge","Raw Materials & Waste","Process Electricity","Fixed Costs","Area Totals","Labels"]
["NONE",{"$f":"\"Nutrient Cost CO2, NH3, DAP   \" & H3","v":"Nutrient Cost CO2, NH3, DAP   120.1$"},0,{"$f":"SUM(OPEX!M16,OPEX!M22,OPEX!M28)","v":120.14411046087031},0,0,{"$f":"SUM(C3:F3)","v":120.14411046087031},{"$f":"TEXT(G3,\"0.0\") & \"$\"","v":"120.1$"},"Feedstock"]
["A100",{"$f":"\"Production Ponds\" & \"  \" & H4","v":"Production Ponds  250.6$"},{"$f":"CAPEX100/CAPEX*SUM('Results Summary'!$F$24:$F$26)","v":186.91293218379909},{"$f":"OPEX!M46","v":3.8480606161057551},{"$f":"'Mass Balance'!AR59/SUM('Mass Balance'!$AR$59:$AR$64)*OPEX!$M$40","v":18.511078775436768},{"$f":"CAPEX100/CAPEX*OPEX!$M$82","v":41.364583776276838},{"$f":"SUM(C4:F4)","v":250.63665535161846},{"$f":"TEXT(G4,\"0.0\") & \"$\"","v":"250.6$"},"Area 100"]
["A200",{"$f":"\"Inoculum Ponds   \" & H5","v":"Inoculum Ponds   23.4$"},{"$f":"CAPEX200/CAPEX*SUM('Results Summary'!$F$24:$F$26)","v":18.66283946443869},0,{"$f":"'Mass Balance'!AR60/SUM('Mass Balance'!$AR$59:$AR$64)*OPEX!$M$40","v":0.56235504421163296},{"$f":"CAPEX200/CAPEX*OPEX!$M$82","v":4.1301614474211972},{"$f":"SUM(C5:F5)","v":23.35535595607152},{"$f":"TEXT(G5,\"0.0\") & \"$\"","v":"23.4$"},"Area 200"]
["A300",{"$f":"\"CO2 On-Site Storage/Piping   \" & H6","v":"CO2 On-Site Storage/Piping   14.9$"},{"$f":"CAPEX300/CAPEX*SUM('Results Summary'!$F$24:$F$26)","v":7.8784375111441491},0,{"$f":"'Mass Balance'!AR61/SUM('Mass Balance'!$AR$59:$AR$64)*OPEX!$M$40","v":5.234429535499987},{"$f":"CAPEX300/CAPEX*OPEX!$M$82","v":1.7435299133578674},14.856396960002005,"14.9$","Area 300"]
["A400",{"$f":"\"Makeup Water Delivery + On-site Circulation   \" & H7","v":"Makeup Water Delivery + On-site Circulation   11.2$"},{"$f":"CAPEX400/CAPEX*SUM('Results Summary'!$F$24:$F$26)","v":8.509642845080819},0,{"$f":"'Mass Balance'!AR62/SUM('Mass Balance'!$AR$59:$AR$64)*OPEX!$M$40","v":0.82687860589248829},{"$f":"CAPEX400/CAPEX*OPEX!$M$82","v":1.8832181928717835},11.219739643845092,"11.2$","Area 400"]
["A500",{"$f":"\"Dewatering   \" & H8","v":"Dewatering   64.0$"},{"$f":"CAPEX500/CAPEX*SUM('Results Summary'!$F$24:$F$26)","v":51.508805141025732},{"$f":"0","v":0},{"$f":"'Mass Balance'!AR63/SUM('Mass Balance'!$AR$59:$AR$64)*OPEX!$M$40","v":1.1335250127039893},{"$f":"CAPEX500/CAPEX*OPEX!$M$82","v":11.399105779244493},64.041435932974224,"64.0$","Area 500"]
["A600",{"$f":"\"Storage   \" & H9","v":"Storage   9.8$"},{"$f":"CAPEX600/CAPEX*SUM('Results Summary'!$F$24:$F$26)","v":6.5273428545115175},{"$f":"0","v":0},{"$f":"'Mass Balance'!AR64/SUM('Mass Balance'!$AR$59:$AR$64)*OPEX!$M$40","v":1.821411823255314},{"$f":"CAPEX600/CAPEX*OPEX!$M$82","v":1.4445272308735753},9.7932819086404059,"9.8$","Area 600"]
[null,"NET SUMMATION",{"$f":"SUM(C4:C9)","v":280},{"$f":"SUM(D3:D9)","v":123.99217107697606},{"$f":"SUM(E3:E9)","v":28.089678797000179},{"$f":"SUM(F3:F9)","v":61.965126340045749},{"$f":"SUM(G3:G9)","v":494.0469762140221},{"$f":"TEXT(G10,\"$0\") & \" /US Dry Ton MBSP\"","v":"$494 /US Dry Ton MBSP"},"RESULT"]

{"sheet":"Facility_Dim","index":7,"n_rows":56,"n_cols":37,"rows_kept":56,"cut":false,"hidden":false,"merged":[]}
[]
[null,null,null,null,null,null,null,null,null,null,null,null,null,null,null,null,null,null,"2-acre Module Dimensions",null,null,null,null,null,null,"10-acre Module Dimensions",null,null,null,null,null,null,"50-acre Module Dimensions"]
[]
[null,null,null,null,null,null,null,null,null,null,null,null,null,null,null,null,null,"Module Size","Rows","Columns","A (ft)","B (ft)",null,null,"Module Size","Rows","Columns","A (ft)","B (ft)",null,null,"Module Size","Rows","Columns","A (ft)","B (ft)"]
[null,null,null,null,null,null,null,null,null,null,null,null,null,null,null,null,null,2,{"$f":"ROUNDUP(R5/2.2/T5,0)","v":1},1,{"$f":"S5*70+ROUND((S5/2),0)*30+2*10","v":120},{"$f":"1370*T5+30*(T5-1)","v":1370},null,null,10,{"$f":"ROUNDUP(Y5/10/AA5,0)","v":1},1,{"$f":"Z5*196+ROUND((Z5/2),0)*30","v":226},{"$f":"2264*AA5+60*(AA5-1)","v":2264},{"$f":"AC5/AB5","v":10.017699115044248},null,50,{"$f":"ROUNDUP(AF5/50/AH5,0)","v":1},1,{"$f":"AG5*2412","v":2412},{"$f":"1320*AH5+60*(AH5-1)","v":1320},{"$f":"AJ5/AI5","v":0.54726368159203975}]
[null,null,null,null,null,null,null,null,null,null,null,null,null,null,null,null,null,5,{"$f":"ROUND(R6/2.2/T6,0)","v":2},1,190,1370,null,null,20,{"$f":"ROUNDUP(Y6/10/AA6,0)","v":2},1,422,2264,{"$f":"AC6/AB6","v":5.3649289099526065},null,100,1,2,{"$f":"AG6*2412","v":2412},{"$f":"1320*AH6+60*(AH6-1)","v":2700},1.1194029850746268]
[null,null,null,null,null,null,null,null,null,null,null,null,null,null,null,null,null,10,5,1,460,1370,null,null,30,3,1,648,2264,3.4938271604938271,null,150,1,3,2412,{"$f":"1320*AH7+60*(AH7-1)","v":4080},1.691542288557214]
[null,null,null,null,null,null,null,null,null,null,null,null,null,null,null,null,null,20,5,2,460,2770,null,null,40,4,1,844,2264,2.6824644549763033,null,200,{"$f":"ROUNDUP(AF8/50/AH8,0)","v":2},3,4824,4080,0.845771144278607]
[null,null,null,null,null,null,null,null,null,null,null,null,null,null,null,null,null,30,7,2,630,2770,null,null,50,5,1,1070,2264,2.1158878504672898,null,250,{"$f":"ROUNDUP(AF9/50/AH9,0)","v":2},3,4824,4080,0.845771144278607]
[null,null,null,null,null,null,null,null,null,null,null,null,null,null,null,null,null,40,9,2,800,2770,null,null,60,6,1,1266,2264,1.7883096366508688,null,300,2,4,4824,5460,1.1318407960199004]
[null,null,null,null,null,null,null,null,null,null,null,null,null,null,null,null,null,50,8,3,700,4170,null,null,70,4,2,844,4588,5.4360189573459712,null,350,2,4,4824,5460,1.1318407960199004]
[null,null,null,null,null,null,null,null,null,null,null,null,null,null,null,null,null,60,9,3,800,4170,null,null,80,4,2,844,4588,5.4360189573459712,null,400,2,4,4824,5460,1.1318407960199004]
[null,null,null,null,null,null,null,null,null,null,null,null,null,null,null,null,null,70,11,3,970,4170,null,null,90,5,2,{"$f":"Z13*196+ROUND((Z13/2),0)*30","v":1070},{"$f":"2264*AA13+60*(AA13-1)","v":4588},4.2878504672897195,null,450,2,5,4824,6840,1.4179104477611941]
[null,null,null,null,null,null,null,null,null,null,null,null,null,null,null,null,null,80,12,3,1040,4170,null,null,100,5,2,{"$f":"Z14*196+ROUND((Z14/2),0)*30","v":1070},{"$f":"2264*AA14+60*(AA14-1)","v":4588},4.2878504672897195,null,500,2,5,4824,6840,1.4179104477611941]
[null,null,null,null,null,null,null,null,null,null,null,null,null,null,null,null,null,90,10,4,870,{"$f":"1370*T15+30*(T15-1)","v":5570},null,null,110,6,2,{"$f":"Z15*196+ROUND((Z15/2),0)*30","v":1266},{"$f":"2264*AA15+60*(AA15-1)","v":4588},3.6240126382306479]
{"$rows_left_out":42}
{"sheet":"Quick Access Charts","index":8,"n_rows":104,"n_cols":19,"rows_kept":104,"cut":false,"hidden":false,"merged":[]}
[null,null,null,null,null,null,null,null,null,null,null,null,null,null,"Cost Indices"]
[null,null,null,null,null,null,null,null,null,null,null,null,null,null,null,null,null,"LOOKUP strings"]
[null,null,null,null,null,null,null,null,null,null,null,null,null,null,null,null,null,"Data Set","Lookup String"]
[null,null,null,null,null,null,null,null,null,null,null,null,null,null,"Plant Cost Indices",null,null,"Index-Capital","INDICES!b15:e41"]
["CO2 Consumed",{"$f":"INPUT!F56*-1","v":-620},"mol CO2 per mol of algae produced",null,null,null,null,null,null,null,null,null,null,null,"Year","Index Used",null,"Index-Chemical","INDICES!b58:e93"]
["DAP Consumed",{"$f":"INPUT!F61*-1","v":-1},"mol of DAP per mol of algae produced",null,null,null,null,null,null,null,null,null,null,null,1990,357.6,null,"Index-Labor","INDICES!b114:e149"]
["NH3 Consumed",{"$f":"(INPUT!F59-INPUT!F61*2)*-1","v":-16},"mol of NH3 per mol of algae produced",null,null,null,null,null,null,null,null,null,null,null,1991,361.3]
["H2O Consumed",{"$f":"(INPUT!F57+B6*9+B7*3)/2*-1","v":-530},"mol of H2O per mol of algae produced",null,null,null,null,null,null,null,null,null,null,null,1992,358.2]
["O2 Produced",{"$f":"((-2*B5-B6*4-B8-INPUT!F58))/2","v":734},"mol of O2 produced per mol of algae produced",null,null,null,null,null,null,null,null,null,null,null,1993,359.2]
[null,null,null,null,null,null,null,null,null,null,null,null,null,null,1994,368.1]
["Ponds - Component Rates",null,null,null,null,null,null,null,null,null,null,null,null,null,1995,381.1]
[null,"Units","Summer","Fall","Winter","Spring","Yearly Average",null,null,null,null,null,null,null,1996,381.7]
["Total Algae Produced in Ponds (AFDW)","kg/hr",{"$f":"INPUT!B46*4046.86*INPUT!$B$10/1000/24","v":29508.354166666668},{"$f":"INPUT!C46*4046.86*INPUT!$B$10/1000/24","v":20993.08625},{"$f":"INPUT!D46*4046.86*INPUT!$B$10/1000/24","v":9864.2212499999987},{"$f":"INPUT!E46*4046.86*INPUT!$B$10/1000/24","v":24028.231250000001},{"$f":"AVERAGE(C13:F13)","v":21098.473229166666},null,null,null,null,null,null,null,1997,386.5]
["Total Algae Produced in Ponds (AFDW)","kmol/hr",{"$f":"C13/INPUT!$B$66","v":2.1458414912521326},{"$f":"D13/INPUT!$B$66","v":1.5266129466336602},{"$f":"E13/INPUT!$B$66","v":0.71732415564714136},{"$f":"F13/INPUT!$B$66","v":1.7473280714481652},1.5342766662452747,null,null,null,null,null,null,null,1998,389.5]
["Required NH3 for Producton Ponds","kmol/hr",{"$f":"C14*$B$7*-1","v":34.333463860034122},{"$f":"D14*$B$7*-1","v":24.425807146138563},{"$f":"E14*$B$7*-1","v":11.477186490354262},{"$f":"F14*$B$7*-1","v":27.957249143170642},24.548426659924395,null,null,null,null,null,null,null,1999,390.6]
{"$rows_left_out":89}