{"text_format":"1","workbook":"xlsx","n_sheets":9,"sheets":["Definitions","Cost Model L-PSH","Cost Curves L-PSH","Cost Model S-PSH","Cost Curves S-PSH","Market Adj Factors","Locational Adj Factors","Land Value Data","Sensitivity Analysis"],"not_rendered":{"charts":64,"images":1,"macros":1,"external_links":0,"defined_names":4,"comments":2,"pivot_tables":0},"unopened":[],"bounds":{"document_bytes":16777216,"sheet_cells":100000,"rows_first":2000,"rows_last":500,"rows_between":2000,"halvings":0,"cell_chars":16384,"cell_head_chars":4096},"cells_cut":0,"cells_raw":0,"read":"whole","date_system":"1900"}

{"sheet":"Definitions","index":0,"n_rows":163,"n_cols":9,"rows_kept":163,"cut":false,"hidden":false,"merged":[]}
["Citation","Cohen, Stuart, Vignesh Ramasamy, and Danny Inman. 2023. A Component-Level Bottom-Up Cost Model for Pumped Storage Hydropower. Golden, CO: National Renewable Energy Laboratory. NREL/TP-6A40-84875. https://www.nrel.gov/docs/fy23osti/84875."]
[]
["Parameter","Parameter Type","Description/Instructions","Options/ Choices (if applicable)","Applicability for Small Scale PSH (<=100 MW) [n/a if blank]","Applicability for Large Scale PSH (>100 MW) [n/a if blank]","Equation/Cost Curve [n/a if blank]","Notes","Data Source"]
["Definitions","Worksheet","This sheet has definitions and descriptions of most terms and parameters within the workbook.","No"]
["Cost Model L-PSH","Worksheet","This sheet includes the core PSH cost model with all base case inputs, assumptions, output specifications, and cost components applicable for a large PSH system.","No"]
["Cost Model S-PSH","Worksheet","This sheet includes the core PSH cost model with all base case inputs, assumptions, output specifications, and cost components applicable for a small PSH system.","No"]
["Cost Curves L-PSH","Worksheet","This sheet includes all underlying cost curves using inputs of the large PSH system to estimate unit and total costs of different components for a large PSH system.","No",null,null,null,"Most of the cost curves are from EPRI GS-6999 report \"Pumped Storage Planning and Evaluation Guide\""]
["Cost Curves S-PSH","Worksheet","This sheet includes all underlying cost curves using inputs of the small PSH system to estimate unit and total costs of different components for a small PSH system.","No",null,null,null,"Most of the cost curves are from EPRI GS-6999 report \"Pumped Storage Planning and Evaluation Guide\""]
["Market Adj Factors","Worksheet","This sheet includes market adjustment factors and inflation factors used to adjust the estimated unit cost to current year values.","No",null,null,null,null,"Industry engagement and U.S. Bureau of Labor and Statistics"]
["Locational Adj Factors","Worksheet","This sheet includes locational cost adjustment factors used to adjust unit cost based on selected location.","No",null,null,null,null,"RSMeans. 2022. “RSMeans City Cost Index - 2022 - Quarter 2.” Gordian. https://www.rsmeans.com/media/wysiwyg/quarterly_updates/Q2-2022-ChangeNotice.pdf"]
{"$rows_left_out":154}
{"sheet":"Cost Model L-PSH","index":1,"n_rows":312,"n_cols":26,"rows_kept":312,"cut":false,"hidden":false,"merged":[[5,1,5,3],[80,1,80,3]]}
[]
[]
[]
[]
[]
[null,"Inputs & Assumptions",null,null,null,"Cost Components","Include in Total? (Yes or No - User Option)","Unit","Qty","Base Unit Cost ($/unit) (Includes material, equipment rental, installation labor)","Locational Factor","CPI + MAF Composite Factor (2022)","USBR Adjustment Factor (2024)","Adjusted Unit Cost ($)","Override Qty","Override Unit Cost ($)","Total Component Cost ($)","% of total cost (component)","% of total cost (category)"]
[]
[null,"Site Related",null,null,null,"Land and Land Rights","Yes","Acres",{"$f":"IF(G8=\"Yes\",IF(O8,O8,C20),0)","v":2185},{"$f":"IFERROR(VLOOKUP(C9,'Land Value Data'!$A$3:$G$51,7,FALSE),'Land Value Data'!G51)","v":3093.3333333333335},1,{"$f":"IF(C54=\"Yes\",'Market Adj Factors'!C48,1)","v":1.1576717200995823},1,{"$f":"IF(P8,P8,J8*K8*L8*M8)","v":3581.0645208413748},0,0,{"$f":"I8*N8","v":7824625.9780384041},{"$f":"Q8/$Q$53","v":2.7809969071505144E-3},{"$f":"R8","v":2.7809969071505144E-3}]
[null,"Location","United States","#"]
[null,"Avg. Max Upper Reservoir Depth",101,"feet",null,"Powerplant Structure","Yes","kW",{"$f":"IF(G10=\"Yes\",IF(O10,O10,C108*1000),0)","v":1283327.8591994315},{"$f":"VLOOKUP(C51,'Cost Curves L-PSH'!AO205:AQ206,3,FALSE)*IF(P10,P10,IF(AND(C46=\"Average\",C47=\"Underground\"),IF(C110<=80,IF(C109<=2,'Cost Curves L-PSH'!B11,IF(AND(C109>2,C109<=3),'Cost Curves L-PSH'!C11,IF(AND(C109>3,C109<=4),'Cost Curves L-PSH'!D11,IF(C109>4,'Cost Curves L-PSH'!E11)))),IF(AND(C110>80,C110<=125),IF(C109<=2,'Cost Curves L-PSH'!B53,IF(AND(C109>2,C109<=3),'Cost Curves L-PSH'!C53,IF(AND(C109>3,C109<=4),'Cost Curves L-PSH'!D53,IF(C109>4,'Cost Curves L-PSH'!E53)))),IF(AND(C110>125,C110<=225),IF(C109<=2,'Cost Curves L-PSH'!L53,IF(AND(C109>2,C109<=3),'Cost Curves L-PSH'!M53,IF(AND(C109>3,C109<=4),'Cost Curves L-PSH'!N53,IF(C109>4,'Cost Curves L-PSH'!O53)))),IF(C110>225,IF(C109<=2,'Cost Curves L-PSH'!L11,IF(AND(C109>2,C109<=3),'Cost Curves L-PSH'!M11,IF(AND(C109>3,C109<=4),'Cost Curves L-PSH'!N11,IF(C109>4,'Cost Curves L-PSH'!O11)))))))),IF(AND(C46=\"Adverse\",C47=\"Underground\"),IF(C110<=80,IF(C109<=2,'Cost Curves L-PSH'!F11,IF(AND(C109>2,C109<=3),'Cost Curves L-PSH'!G11,IF(AND(C109>3,C109<=4),'Cost Curves L-PSH'!H11,IF(C109>4,'Cost Curves L-PSH'!I11)))),IF(AND(C110>80,C110<=125),IF(C109<=2,'Cost Curves L-PSH'!F53,IF(AND(C109>2,C109<=3),'Cost Curves L-PSH'!G53,IF(AND(C109>3,C109<=4),'Cost Curves L-PSH'!H53,IF(C109>4,'Cost Curves L-PSH'!I53)))),IF(AND(C110>125,C110<=225),IF(C109<=2,'Cost Curves L-PSH'!P53,IF(AND(C109>2,C109<=3),'Cost Curves L-PSH'!Q53,IF(AND(C109>3,C109<=4),'Cost Curves L-PSH'!R53,IF(C109>4,'Cost Curves L-PSH'!S53)))),IF(C110>225,IF(C109<=2,'Cost Curves L-PSH'!P11,IF(AND(C109>2,C109<=3),'Cost Curves L-PSH'!Q11,IF(AND(C109>3,C109<=4),'Cost Curves L-PSH'!R11,IF(C109>4,'Cost Curves L-PSH'!S11)))))))),IF(AND(C46=\"Average\",C47=\"Surface\"),IF(C110<=80,IF(C109<=2,'Cost Curves L-PSH'!V11,IF(AND(C109>2,C109<=3),'Cost Curves L-PSH'!W11,IF(AND(C109>3,C109<=4),'Cost Curves L-PSH'!X11,IF(C109>4,'Cost Curves L-PSH'!Y11)))),IF(AND(C110>80,C110<=125),IF(C109<=2,'Cost Curves L-PSH'!V53,IF(AND(C109>2,C109<=3),'Cost Curves L-PSH'!W53,IF(AND(C109>3,C109<=4),'Cost Curves L-PSH'!X53,IF(C109>4,'Cost Curves L-PSH'!Y53)))),IF(AND(C110>125,C110<=225),IF(C109<=2,'Cost Curves L-PSH'!AF53,IF(AND(C109>2,C109<=3),'Cost Curves L-PSH'!AG53,IF(AND(C109>3,C109<=4),'Cost Curves L-PSH'!AH53,IF(C109>4,'Cost Curves L-PSH'!AI53)))),IF(C110>225,IF(C109<=2,'Cost Curves L-PSH'!AF11,IF(AND(C109>2,C109<=3),'Cost Curves L-PSH'!AG11,IF(AND(C109>3,C109<=4),'Cost Curves L-PSH'!AH11,IF(C109>4,'Cost Curves L-PSH'!AI11)))))))),IF(AND(C46=\"Adverse\",C47=\"Surface\"),IF(C110<=80,IF(C109<=2,'Cost Curves L-PSH'!Z11,IF(AND(C109>2,C109<=3),'Cost Curves L-PSH'!AA11,IF(AND(C109>3,C109<=4),'Cost Curves L-PSH'!AB11,IF(C109>4,'Cost Curves L-PSH'!AC11)))),IF(AND(C110>80,C110<=125),IF(C109<=2,'Cost Curves L-PSH'!Z53,IF(AND(C109>2,C109<=3),'Cost Curves L-PSH'!AA53,IF(AND(C109>3,C109<=4),'Cost Curves L-PSH'!AB53,IF(C109>4,'Cost Curves L-PSH'!AC53)))),IF(AND(C110>125,C110<=225),IF(C109<=2,'Cost Curves L-PSH'!AJ53,IF(AND(C109>2,C109<=3),'Cost Curves L-PSH'!AK53,IF(AND(C109>3,C109<=4),'Cost Curves L-PSH'!AL53,IF(C109>4,'Cost Curves L-PSH'!AM53)))),IF(C110>225,IF(C109<=2,'Cost Curves L-PSH'!AJ11,IF(AND(C109>2,C109<=3),'Cost Curves L-PSH'!AK11,IF(AND(C109>3,C109<=4),'Cost Curves L-PSH'!AL11,IF(C109>4,'Cost Curves L-PSH'!AM11)))))))))))))","v":39.0597787354559},{"$f":"VLOOKUP(C9,'Locational Adj Factors'!$A$3:$B$55,2,FALSE)/100","v":1},{"$f":"IF(C54=\"Yes\",'Market Adj Factors'!U61,1)","v":3.1330000000000005},{"$f":"'Market Adj Factors'!X61","v":1.0666666666666667},{"$f":"IF(P10,P10,J10*K10*L10*M10)","v":130.53257256339558},0,0,{"$f":"N10*I10","v":167516086.90357688},{"$f":"Q10/$Q$53","v":5.9537889847304029E-2},{"$f":"R10","v":5.9537889847304029E-2}]
{"$rows_left_out":303}
{"sheet":"Cost Curves L-PSH","index":2,"n_rows":378,"n_cols":43,"rows_kept":378,"cut":false,"hidden":false,"merged":[[310,17,310,18],[310,20,310,21],[85,21,85,24],[85,25,85,28],[43,1,43,4],[43,5,43,8],[43,11,43,14],[43,15,43,18],[43,21,43,24],[43,25,43,28],[42,1,42,7],[42,11,42,17],[42,21,42,27],[42,31,42,37],[84,0,84,2],[84,21,84,27],[43,31,43,34],[43,35,43,38],[0,1,0,7],[0,11,0,17],[0,21,0,27],[0,31,0,37],[1,1,1,4],[1,5,1,8],[1,11,1,14],[1,15,1,18],[1,21,1,24],[1,25,1,28],[1,31,1,34],[1,35,1,38]]}
[null,"Underground Powestation Structure Cost 80MW units",null,null,null,null,null,null,null,null,null,"Underground Powestation Structure Cost 350MW units",null,null,null,null,null,null,null,null,null,"Surface Powestation Structure Cost 80MW units",null,null,null,null,null,null,null,null,null,"Surface Powestation Structure Cost 350MW units"]
[null,"$/kW Average Conditions",null,null,null,"$/kW Adverse Conditions",null,null,null,null,null,"$/kW Average Conditions",null,null,null,"$/kW Adverse Conditions",null,null,null,null,null,"$/kW Average Conditions",null,null,null,"$/kW Adverse Conditions",null,null,null,null,null,"$/kW Average Conditions",null,null,null,"$/kW Adverse Conditions"]
["Average Head, Ft","2 Units","3 Units","4 Units","6 Units","2 Units","3 Units","4 Units","6 Units",null,"Average Head, Ft","2 Units","3 Units","4 Units","6 Units","2 Units","3 Units","4 Units","6 Units",null,"Average Head, Ft","2 Units","3 Units","4 Units","6 Units","2 Units","3 Units","4 Units","6 Units",null,"Average Head, Ft","2 Units","3 Units","4 Units","6 Units","2 Units","3 Units","4 Units","6 Units"]
[350,135,116,104,92,174,145,132,118,null,500,78,70,62,58,98,84,78,70,null,350,84,77,72.5,67,112,95,87,78,null,350,38,35,32,30,58,48.5,45,39]
[500,113,96,86,78,150,124,113.5,102,null,1000,48,42,37,33,62,52,46,42.25,null,500,84,77.25,74,68,113.5,96,89,79.5,null,500,36,34,30,28,54,45,42,37]
[1000,91,76,68,60,116,98,86,76.5,null,1500,40.5,34,30,26,53,43,39,34.5,null,1000,87,80,76,74,118,102,93,85,null,1000,31,28,26,25,45,40,37,34]
[1500,81,69,59.5,54,103,88,77,68.5,null,2000,36,31,26,24,45,39,34.5,26,null,1500,92.5,86,84,80,125,108,100,91.5,null,1500,30,27,26,25.25,44.5,39,36,32]
[2000,78,63,58,50,98,82,72,62.5,null,2250,35,30,25,23,44,38,33.5,25,null,2000,102,95,92,87,134,116,106,98,null,2000,32,30,29,26,46,41,38,34]
[2250,77,62,57,49,97,81,71,62,null,null,null,null,null,null,null,null,null,null,null,2250,105.5,98,95,90,137,119,109.5,100,null,2250,33,31,30,28,48,42,39.5,35]
[null,"y = 740.12x-0.298","y = 760.42x-0.328","y = 645.72x-0.32","y = 640.28x-0.337","y = 1096.7x-0.319","y = 878.1x-0.313","y = 926.99x-0.337","y = 911.22x-0.352",null,null,"y = 2032.8x-0.532","y = 2231.2x-0.565","y = 2553x-0.604","y = 2504.2x-0.615","y = 2613x-0.533","y = 2154.7x-0.53","y = 2380.6x-0.559","y = 4996.8x-0.687",null,null,"y = 5E-06x2 - 0.0009x + 83.095","y = 4E-06x2 + 0.0004x + 75.715","y = 4E-06x2 + 0.0021x + 71.437","y = 6E-07x2 + 0.0109x + 62.383","y = 3E-06x2 + 0.0062x + 109.48","y = 1E-06x2 + 0.0099x + 90.767","y = 2E-06x2 + 0.0073x + 84.676","y = -1E-07x2 + 0.0123x + 73.167",null,null,"y = 6E-06x2 - 0.0183x + 43.547","y = 7E-06x2 - 0.0198x + 41.489","y = 6E-06x2 - 0.0162x + 36.672","y = 5E-06x2 - 0.0128x + 33.573","y = 1E-05x2 - 0.0308x + 67.023","y = 7E-06x2 - 0.0207x + 54.238","y = 7E-06x2 - 0.0205x + 50.886","y = 5E-06x2 - 0.0146x + 43.361"]
{"$rows_left_out":369}
{"sheet":"Cost Model S-PSH","index":3,"n_rows":121,"n_cols":21,"rows_kept":121,"cut":false,"hidden":false,"merged":[[5,1,6,3]]}
[]
[]
[]
[]
[]
[null,"Inputs & Assumptions",null,null,null,"Cost Components","Include in Total? (Yes or No - User Option)","Unit","Qty","Base Unit Cost ($/unit) (Includes material, equipment rental, installation labor)","Locational Factor","CPI + MAF Composite (2022)","USBR Adjustment Factor (2024)","Adjusted Unit Cost ($)","Override Qty","Override Unit Cost ($)","Total Component Cost ($)","% of total cost (component)","% of total cost (category)"]
[]
[null,"Site Related",null,null,null,"Land and Land Rights","Yes","Acres",{"$f":"IF(G8=\"Yes\",IF(O8,O8,C20),0)","v":2185},{"$f":"IFERROR(VLOOKUP(C9,'Land Value Data'!$A$3:$G$51,7,FALSE),'Land Value Data'!G51)","v":3093.3333333333335},1,{"$f":"IF(C54=\"Yes\",'Market Adj Factors'!C48,1)","v":1.1576717200995823},1,{"$f":"IF(P8,P8,J8*K8*L8*M8)","v":3581.0645208413748},0,0,{"$f":"I8*N8","v":7824625.9780384041},{"$f":"Q8/$Q$53","v":2.8363941761976566E-3},{"$f":"R8","v":2.8363941761976566E-3},16264166.097278001]
[null,"Location","United States","#"]
[null,"Avg. Max Upper Reservoir Depth",101,"feet",null,"Powerplant Structure","Yes","kW",{"$f":"IF(G10=\"Yes\",IF(O10,O10,C108*1000),0)","v":1283324.8207034676},{"$f":"VLOOKUP(C51,'Cost Curves S-PSH'!AO205:AQ206,3,FALSE)*IF(P10,P10,IF(AND(C46=\"Average\",C47=\"Underground\"),IF(C110<=80,IF(C109<=2,'Cost Curves S-PSH'!B11,IF(AND(C109>2,C109<=3),'Cost Curves S-PSH'!C11,IF(AND(C109>3,C109<=4),'Cost Curves S-PSH'!D11,IF(C109>4,'Cost Curves S-PSH'!E11)))),IF(AND(C110>80,C110<=125),IF(C109<=2,'Cost Curves S-PSH'!B53,IF(AND(C109>2,C109<=3),'Cost Curves S-PSH'!C53,IF(AND(C109>3,C109<=4),'Cost Curves S-PSH'!D53,IF(C109>4,'Cost Curves S-PSH'!E53)))),IF(AND(C110>125,C110<=225),IF(C109<=2,'Cost Curves S-PSH'!L53,IF(AND(C109>2,C109<=3),'Cost Curves S-PSH'!M53,IF(AND(C109>3,C109<=4),'Cost Curves S-PSH'!N53,IF(C109>4,'Cost Curves S-PSH'!O53)))),IF(C110>225,IF(C109<=2,'Cost Curves S-PSH'!L11,IF(AND(C109>2,C109<=3),'Cost Curves S-PSH'!M11,IF(AND(C109>3,C109<=4),'Cost Curves S-PSH'!N11,IF(C109>4,'Cost Curves S-PSH'!O11)))))))),IF(AND(C46=\"Adverse\",C47=\"Underground\"),IF(C110<=80,IF(C109<=2,'Cost Curves S-PSH'!F11,IF(AND(C109>2,C109<=3),'Cost Curves S-PSH'!G11,IF(AND(C109>3,C109<=4),'Cost Curves S-PSH'!H11,IF(C109>4,'Cost Curves S-PSH'!I11)))),IF(AND(C110>80,C110<=125),IF(C109<=2,'Cost Curves S-PSH'!F53,IF(AND(C109>2,C109<=3),'Cost Curves S-PSH'!G53,IF(AND(C109>3,C109<=4),'Cost Curves S-PSH'!H53,IF(C109>4,'Cost Curves S-PSH'!I53)))),IF(AND(C110>125,C110<=225),IF(C109<=2,'Cost Curves S-PSH'!P53,IF(AND(C109>2,C109<=3),'Cost Curves S-PSH'!Q53,IF(AND(C109>3,C109<=4),'Cost Curves S-PSH'!R53,IF(C109>4,'Cost Curves S-PSH'!S53)))),IF(C110>225,IF(C109<=2,'Cost Curves S-PSH'!P11,IF(AND(C109>2,C109<=3),'Cost Curves S-PSH'!Q11,IF(AND(C109>3,C109<=4),'Cost Curves S-PSH'!R11,IF(C109>4,'Cost Curves S-PSH'!S11)))))))),IF(AND(C46=\"Average\",C47=\"Surface\"),IF(C110<=80,IF(C109<=2,'Cost Curves S-PSH'!V11,IF(AND(C109>2,C109<=3),'Cost Curves S-PSH'!W11,IF(AND(C109>3,C109<=4),'Cost Curves S-PSH'!X11,IF(C109>4,'Cost Curves S-PSH'!Y11)))),IF(AND(C110>80,C110<=125),IF(C109<=2,'Cost Curves S-PSH'!V53,IF(AND(C109>2,C109<=3),'Cost Curves S-PSH'!W53,IF(AND(C109>3,C109<=4),'Cost Curves S-PSH'!X53,IF(C109>4,'Cost Curves S-PSH'!Y53)))),IF(AND(C110>125,C110<=225),IF(C109<=2,'Cost Curves S-PSH'!AF53,IF(AND(C109>2,C109<=3),'Cost Curves S-PSH'!AG53,IF(AND(C109>3,C109<=4),'Cost Curves S-PSH'!AH53,IF(C109>4,'Cost Curves S-PSH'!AI53)))),IF(C110>225,IF(C109<=2,'Cost Curves S-PSH'!AF11,IF(AND(C109>2,C109<=3),'Cost Curves S-PSH'!AG11,IF(AND(C109>3,C109<=4),'Cost Curves S-PSH'!AH11,IF(C109>4,'Cost Curves S-PSH'!AI11)))))))),IF(AND(C46=\"Adverse\",C47=\"Surface\"),IF(C110<=80,IF(C109<=2,'Cost Curves S-PSH'!Z11,IF(AND(C109>2,C109<=3),'Cost Curves S-PSH'!AA11,IF(AND(C109>3,C109<=4),'Cost Curves S-PSH'!AB11,IF(C109>4,'Cost Curves S-PSH'!AC11)))),IF(AND(C110>80,C110<=125),IF(C109<=2,'Cost Curves S-PSH'!Z53,IF(AND(C109>2,C109<=3),'Cost Curves S-PSH'!AA53,IF(AND(C109>3,C109<=4),'Cost Curves S-PSH'!AB53,IF(C109>4,'Cost Curves S-PSH'!AC53)))),IF(AND(C110>125,C110<=225),IF(C109<=2,'Cost Curves S-PSH'!AJ53,IF(AND(C109>2,C109<=3),'Cost Curves S-PSH'!AK53,IF(AND(C109>3,C109<=4),'Cost Curves S-PSH'!AL53,IF(C109>4,'Cost Curves S-PSH'!AM53)))),IF(C110>225,IF(C109<=2,'Cost Curves S-PSH'!AJ11,IF(AND(C109>2,C109<=3),'Cost Curves S-PSH'!AK11,IF(AND(C109>3,C109<=4),'Cost Curves S-PSH'!AL11,IF(C109>4,'Cost Curves S-PSH'!AM11)))))))))))))","v":39.0597787354559},{"$f":"VLOOKUP(C9,'Locational Adj Factors'!$A$3:$B$55,2,FALSE)/100","v":1},{"$f":"IF(C54=\"Yes\",'Market Adj Factors'!U61,1)","v":3.1330000000000005},{"$f":"'Market Adj Factors'!X61","v":1.0666666666666667},{"$f":"IF(P10,P10,J10*K10*L10*M10)","v":130.53257256339558},0,0,{"$f":"N10*I10","v":167515690.280882},{"$f":"Q10/$Q$53","v":6.0723736785376611E-2},{"$f":"R10","v":6.0723736785376611E-2},156806247.94734025]
{"$rows_left_out":112}
{"sheet":"Cost Curves S-PSH","index":4,"n_rows":378,"n_cols":43,"rows_kept":378,"cut":false,"hidden":false,"merged":[[290,26,290,27],[290,24,290,25],[0,1,0,7],[0,11,0,17],[0,21,0,27],[42,1,42,7],[42,11,42,17],[42,21,42,27],[85,21,85,24],[85,25,85,28],[0,31,0,37],[1,1,1,4],[1,5,1,8],[1,11,1,14],[1,15,1,18],[1,21,1,24],[1,25,1,28],[1,31,1,34],[1,35,1,38],[42,31,42,37],[43,31,43,34],[43,35,43,38],[84,0,84,2],[84,21,84,27],[43,1,43,4],[43,5,43,8],[43,11,43,14],[43,15,43,18],[43,21,43,24],[43,25,43,28]]}
[null,"Underground Powestation Structure Cost 80MW units",null,null,null,null,null,null,null,null,null,"Underground Powestation Structure Cost 350MW units",null,null,null,null,null,null,null,null,null,"Surface Powestation Structure Cost 80MW units",null,null,null,null,null,null,null,null,null,"Surface Powestation Structure Cost 350MW units"]
[null,"$/kW Average Conditions",null,null,null,"$/kW Adverse Conditions",null,null,null,null,null,"$/kW Average Conditions",null,null,null,"$/kW Adverse Conditions",null,null,null,null,null,"$/kW Average Conditions",null,null,null,"$/kW Adverse Conditions",null,null,null,null,null,"$/kW Average Conditions",null,null,null,"$/kW Adverse Conditions"]
["Average Head, Ft","160 MW","240 MW","320 MW","480 MW","160 MW","240 MW","320 MW","480 MW",null,"Average Head, Ft","700 MW","1050 MW","1400 MW","2100 MW","700 MW","1050 MW","1400 MW","2100 MW",null,"Average Head, Ft","160 MW","240 MW","320 MW","480 MW","160 MW","240 MW","320 MW","480 MW",null,"Average Head, Ft","700 MW","1050 MW","1400 MW","2100 MW","700 MW","1050 MW","1400 MW","2100 MW"]
[350,135,116,104,92,174,145,132,118,null,500,78,70,62,58,98,84,78,70,null,350,84,77,72.5,67,112,95,87,78,null,350,38,35,32,30,58,48.5,45,39]
[500,113,96,86,78,150,124,113.5,102,null,1000,48,42,37,33,62,52,46,42.25,null,500,84,77.25,74,68,113.5,96,89,79.5,null,500,36,34,30,28,54,45,42,37]
[1000,91,76,68,60,116,98,86,76.5,null,1500,40.5,34,30,26,53,43,39,34.5,null,1000,87,80,76,74,118,102,93,85,null,1000,31,28,26,25,45,40,37,34]
[1500,81,69,59.5,54,103,88,77,68.5,null,2000,36,31,26,24,45,39,34.5,26,null,1500,92.5,86,84,80,125,108,100,91.5,null,1500,30,27,26,25.25,44.5,39,36,32]
[2000,78,63,58,50,98,82,72,62.5,null,2250,35,30,25,23,44,38,33.5,25,null,2000,102,95,92,87,134,116,106,98,null,2000,32,30,29,26,46,41,38,34]
[2250,77,62,57,49,97,81,71,62,null,null,null,null,null,null,null,null,null,null,null,2250,105.5,98,95,90,137,119,109.5,100,null,2250,33,31,30,28,48,42,39.5,35]
[null,"y = 740.12x-0.298","y = 760.42x-0.328","y = 645.72x-0.32","y = 640.28x-0.337","y = 1096.7x-0.319","y = 878.1x-0.313","y = 926.99x-0.337","y = 911.22x-0.352",null,null,"y = 2032.8x-0.532","y = 2231.2x-0.565","y = 2553x-0.604","y = 2504.2x-0.615","y = 2613x-0.533","y = 2154.7x-0.53","y = 2380.6x-0.559","y = 4996.8x-0.687",null,null,"y = 5E-06x2 - 0.0009x + 83.095","y = 4E-06x2 + 0.0004x + 75.715","y = 4E-06x2 + 0.0021x + 71.437","y = 6E-07x2 + 0.0109x + 62.383","y = 3E-06x2 + 0.0062x + 109.48","y = 1E-06x2 + 0.0099x + 90.767","y = 2E-06x2 + 0.0073x + 84.676","y = -1E-07x2 + 0.0123x + 73.167",null,null,"y = 6E-06x2 - 0.0183x + 43.547","y = 7E-06x2 - 0.0198x + 41.489","y = 6E-06x2 - 0.0162x + 36.672","y = 5E-06x2 - 0.0128x + 33.573","y = 1E-05x2 - 0.0308x + 67.023","y = 7E-06x2 - 0.0207x + 54.238","y = 7E-06x2 - 0.0205x + 50.886","y = 5E-06x2 - 0.0146x + 43.361"]
{"$rows_left_out":369}
{"sheet":"Market Adj Factors","index":5,"n_rows":74,"n_cols":37,"rows_kept":74,"cut":false,"hidden":false,"merged":[]}
[]
[]
[]
[]
[null,"Category","Suggested","EPRI Fig",null,null,"Year","Avg. CPI","Inflation Adjustment to 1988$",null,null,null,null,null,null,null,"USBR Category","MAF Category",1988,2010,2011,2012,2013,2014,2015,2016,2017,2018,2019,2020,2021,2022,2023,2024,null,null,"Incorporate fatcors"]
[null,"Power station",1.3,"6-8/6-9",null,null,1970,38.841666666666661,{"$f":"H6/$H$24","v":0.32840132459663202},null,null,null,null,null,null,null,"Power plant - structures and improvements","Power station",158.5,323.25,335.5,346.25,351.75,359.75,364,367,378,393,406,408,433,480,501,512,null,null,"Adjust liner sq.ft calculation"]
[null,"Dams, spillways, diversions, emb",1.4,"6-10",null,null,1971,40.483333333333334,0.34228140632706261,null,null,null,null,null,null,null,"Earth Dams","Dams, spillways, diversions, emb",144.5,301.25,317.75,329.75,334.25,339.5,333.5,333,346,360,372,374,400,453,475,484]
[null,"Upper intake/outlet (vertical)",2,"6-12",null,null,1972,41.80833333333333,0.35348411188614098,null,null,null,null,null,null,null,"Earth Dams - outlet works","Upper intake/outlet (vertical)",166.75,341.5,357,367.75,372.5,379.75,378.5,379,389,405,415,416,447,501,517,522]
[null,"Lower intake/outlet (horizontal)",1.3,"6-12",null,null,1973,44.425000000000004,0.37560769393362925,null,null,null,null,null,null,null,"Earth Dams - outlet works","Lower intake/outlet (horizontal)",166.75,341.5,357,367.75,372.5,379.75,378.5,379,389,405,415,416,447,501,517,522]
[null,"Surface penstocks",1.3,"6-16",null,null,1974,49.316666666666663,0.41696611005425199,null,null,null,null,null,null,null,"Steel pipelines","Surface penstocks",170.25,355.75,365.75,374.75,382.75,390.75,397.5,403,411,419,428,429,454,506,521,524]
{"$rows_left_out":65}
{"sheet":"Locational Adj Factors","index":6,"n_rows":55,"n_cols":3,"rows_kept":55,"cut":false,"hidden":false,"merged":[[0,1,0,2]]}
[null,"Location Factor"]
["State  ","Material Cost","Equipment Rental"]
["Alabama",96.8,59.3]
["Alaska",125.3,114.2]
["Arizona",97.5,68.8]
["Arkansas",95.3,57.3]
["California",98.2,118.8]
["Colorado",101.2,80.5]
["Connecticut",101.3,120.1]
["Delaware",99.3,107.9]
{"$rows_left_out":46}
{"sheet":"Land Value Data","index":7,"n_rows":51,"n_cols":7,"rows_kept":51,"cut":false,"hidden":false,"merged":[]}
[]
["State","Farm Real Estate $/Acre 2021","Cropland $/Acre 2021","Irrigated Cropland $/Acre 2021","Non-Irrigated Cropland $/Acre 2021","Pasture $/Acre 2021","Average $/Acre 2021"]
["Connecticut",12500,8770,null,null,6870,{"$f":"AVERAGE(B3:F3)","v":9380}]
["Delaware",9300,8600,null,null,6870,{"$f":"AVERAGE(B4:F4)","v":8256.6666666666661}]
["Maine",2600,8770,null,null,6870,6080]
["Maryland",8670,7960,null,null,null,8315]
["Massachusetts",13700,8770,null,null,6870,9780]
["New Hampshire",5050,8770,null,null,6870,6896.666666666667]
["New Jersey",14400,14800,null,null,13400,14200]
["New York",3270,2910,null,null,1580,2586.6666666666665]
{"$rows_left_out":42}
{"sheet":"Sensitivity Analysis","index":8,"n_rows":99,"n_cols":20,"rows_kept":99,"cut":false,"hidden":false,"merged":[]}
["#","Duration (Hrs)","Nominal Head (Ft)","Conveyance Length (Ft)","Average U. Dam Height (ft)","Average L. Dam Height (ft)","Power Station Type","Transmission Miles","Average U. Crest Length (Ft)","Average L. Crest Length (Ft)","Power Station Structure Geology Type","Access Tunnel Length (Miles)","U. Reservoir Intake/Outlet Type","Tranmission Type","Penstock Type","L. Reservoir Intake/Outlet Type","$/kWh","$/kW"]
[1,18.5,1560,14394,120,60,"Underground",13.5,1300,1100,"Adverse",1.25,"Vertical","Double","Underground","Horizontal",16281.237999999999,20894166318.827499]
[2,24,1560,14394,120,60,"Underground",13.5,1300,1100,"Adverse",1.25,"Vertical","Double","Underground","Horizontal",17636.692200000001,17292971471.354801]
[3,10,1560,14394,120,60,"Underground",13.5,1300,1100,"Adverse",1.25,"Vertical","Double","Underground","Horizontal",14001.987499999999,33781464985.5117]
[4,18.5,2500,14394,120,60,"Underground",13.5,1300,1100,"Adverse",1.25,"Vertical","Double","Underground","Horizontal",11907.936799999999,24983617807.690701]
[5,18.5,800,14394,120,60,"Underground",13.5,1300,1100,"Adverse",1.25,"Vertical","Double","Underground","Horizontal",26109.4558,16308089591.5103]
[6,18.5,1560,5000,120,60,"Underground",13.5,1300,1100,"Adverse",1.25,"Vertical","Double","Underground","Horizontal",13251.6643,17601141505.456299]
[7,18.5,1560,25000,120,60,"Underground",13.5,1300,1100,"Adverse",1.25,"Vertical","Double","Underground","Horizontal",19726.200400000002,24315351846.477299]
[8,18.5,1560,14394,60,60,"Underground",13.5,1300,1100,"Adverse",1.25,"Vertical","Double","Underground","Horizontal",15794.116599999999,20269029829.169701,null,"*Any changes to current input cell reference need to be manually updated in the macro."]
[9,18.5,1560,14394,240,240,"Underground",13.5,1300,1100,"Adverse",1.25,"Vertical","Double","Underground","Horizontal",19949.6083,25601888102.149799,null,"Yellow highlighted cell inputs affect the sensitivity graphs"]
{"$rows_left_out":89}